{"text_format":"1","workbook":"xlsx","n_sheets":7,"sheets":["Estimar Flete","Salarios","Costos Vehículo","Rutas","peajes NACIONAL ","P&G Operación","Escenario Actual"],"not_rendered":{"charts":0,"images":1,"macros":1,"external_links":1,"defined_names":50,"comments":0,"pivot_tables":0},"unopened":[],"bounds":{"document_bytes":16777216,"sheet_cells":100000,"rows_first":2000,"rows_last":500,"rows_between":2000,"halvings":0,"cell_chars":16384,"cell_head_chars":4096},"cells_cut":0,"cells_raw":0,"read":"whole","date_system":"1900"}

{"sheet":"Estimar Flete","index":0,"n_rows":26,"n_cols":19,"rows_kept":26,"cut":false,"hidden":false,"merged":[[1,2,1,6],[7,1,12,1],[14,1,25,1],[3,1,4,1],[3,2,4,3]]}
[]
[null,null,"COSTEADOR DE RUTAS COLOMBIA",null,null,null,null,null,null,null,null,null,null,null,"Tipo Vehìculo",null,"Validación",null,"Auxiliares"]
[null,null,null,null,null,null,null,null,"COSTOS 25%",null,null,null,null,null,"Carry",null,"Sí",null,0]
[null,"Ruta","MEDELLIN-CALI",null,null,"Distancia Km",{"$f":"VLOOKUP(C4,'peajes NACIONAL '!$B$2:$C$60,2,0)","v":425},null,"NOMINA 10%",null,null,null,null,null,"Luv",null,"No",null,1]
[null,null,null,null,null,"Tiempo Estimado",{"$f":"VLOOKUP(C4,'peajes NACIONAL '!B2:E60,4,0)","v":"07:45:00"},null,null,null,null,null,null,null,"NHR",null,null,null,2]
[null,"URBANAS",null,null,null,"Viaje ida y vuelta","Sí",null,null,null,null,null,null,null,"NKR",null,null,null,3]
{"$rows_left_out":21}
{"sheet":"Salarios","index":1,"n_rows":38,"n_cols":16,"rows_kept":38,"cut":false,"hidden":true,"merged":[[18,1,21,1],[23,1,34,1],[28,5,28,12],[2,1,4,1],[6,1,11,1],[13,1,16,1]]}
[null,null,null,"Salario",1567125,2675295]
[null,null,"CONCEPTOS","Factor","Costos Mes","HO DOMINICAL FESTIVA 175%","RN -35%","HED-125%","HEN - 175%","RN DOMINICAL 110%","RN DOMINICAL FESTIVO 210%","HED DOMINICAL FESTIVA 200%","HEN DOMINICAL FESTIVA 250%",null,"Costo x Persona x Dïa Empresa Temporal",86300]
[null,"Basico","Salario",null,{"$f":"IF('Estimar Flete'!D8=\"TRACTOMULA\",Salarios!F1,E1)","v":2675295},{"$f":"(E3/240)*(175%)","v":19507.359375},{"$f":"(E3/240)*35%","v":3901.4718749999997},{"$f":"(E3/240)*125%","v":13933.828125},{"$f":"(E3/240)*175%","v":19507.359375},{"$f":"(E3/240)*(35%+75%)","v":12261.768750000001},{"$f":"(E3/240)*(35%+175%)","v":23408.831249999999},{"$f":"(E3/240)*(175%+25%)","v":22294.125},{"$f":"(E3/240)*(175%+75%)","v":27867.65625}]
[null,null,"Auxilio de Transporte",null,0]
[null,null,"Total",null,{"$f":"SUM(E3:E4)","v":2675295},{"$f":"SUM(F3:F4)","v":19507.359375},{"$f":"SUM(G3:G4)","v":3901.4718749999997},13933.828125,19507.359375,12261.768750000001,23408.831249999999,22294.125,27867.65625]
[]
{"$rows_left_out":33}
{"sheet":"Costos Vehículo","index":2,"n_rows":41,"n_cols":43,"rows_kept":41,"cut":false,"hidden":true,"merged":[[2,31,2,33],[2,34,2,36],[2,37,2,39],[2,19,2,21],[2,1,2,2],[2,22,2,24],[2,25,2,27],[2,28,2,30],[34,1,34,2],[2,6,2,11],[1,1,1,11],[2,16,2,18],[24,1,24,2],[13,6,13,7],[14,6,14,7],[12,6,12,7],[2,15,3,15],[15,6,15,7],[6,1,14,1],[15,1,23,1],[25,1,32,1],[3,1,5,1]]}
[null,null,null,null,null,null,null,null,null,null,null,null,null,null,null,1.0311999999999999]
["<<<<<<<<<<<<<","Costos",null,null,null,null,null,null,null,null,null,null,null,null,null,"Costos Variables x Kilómentro"]
[null,"Seguros e Impuestos",null,"Mes","Año 2019",null,"Mantenimiento Termo",null,null,null,null,null,null,null,null,"Gtos Mtto","Carry",null,null,"Luv",null,null,"NHR",null,null,"NKR",null,null,"NPR",null,null,"Sencillo",null,null,"Dobletroque",null,null,"TractoMula"]
[null,"SOAT","< 5 Ton",{"$f":"E4/12","v":61033.333333333336},732400,null,"Descripción","Cant","Valor","Frecuencia","Total Mes","Total Año",null,null,1.04,null,"Frec/km","Precio","$/Km","Frec/km","Precio","$/Km","Frec/km","Precio","$/Km","Frec/km","Precio","$/Km","Frec/km","Precio","$/Km","Frecuencia / Km","Precio","$/Km","Frec/km","Precio","$/Km","Frec/km","Precio","$/Km"]
[null,null,"5 - 15 Ton",{"$f":"E5/12","v":88125},1057500,null,"Filtro de Aceite Motor",1,36660.088080000001,"4 / Año",{"$f":"L5/12","v":12220.02936},{"$f":"I5*4","v":146640.35232000001},null,null,null,"Motor",250000,5003929.7609599996,{"$f":"R5/Q5","v":20.015719043839997},250000,5204086.9513983997,{"$f":"U5/T5","v":20.816347805593598},250000,6299596.4442111989,{"$f":"X5/W5","v":25.198385776844795},250000,6847415.323007999,{"$f":"AA5/Z5","v":27.389661292031995},250000,8901704.0523007996,{"$f":"AD5/AC5","v":35.606816209203195},400000,14799782.399999999,{"$f":"AG5/AF5","v":36.999455999999995},550000,19733043.199999999,{"$f":"AJ5/AI5","v":35.878260363636365},350000,24666303.999999996,{"$f":"AM5/AL5","v":70.475154285714268}]
[null,null,"> 15 Ton",{"$f":"E6/12","v":111416.66666666667},1337000,null,"Filtro de Aceite By Pass",1,37517.633999999998,"4 / Año",12505.877999999999,150070.53599999999,null,null,null,"Caja",250000,1975277.6243199997,7.9011104972799986,250000,2054288.7292927997,8.2171549171711984,250000,2465120.8221952002,9.8604832887808005,250000,2465120.8221952002,9.8604832887808005,250000,2738966.1292031999,10.955864516812799,250000,3083287.9999999995,12.333151999999998,350000,3699945.5999999996,10.571273142857141,180000,4933260.8,{"$f":"AM6/AL6","v":27.407004444444443}]
{"$rows_left_out":36}
{"sheet":"Rutas","index":3,"n_rows":59,"n_cols":50,"rows_kept":59,"cut":false,"hidden":true,"merged":[]}
[]
["Nombre Ruta","Tipo de Vehículo","TIEMPO ESTIMADO","Vehículo con Refrigeración","Lavado Furgón","N° de Auxiliares Directos","N° de Auxiliares por Prestación","Alimentación","Kilometraje Ruta","Costo Galón Combustible","Costo Peajes y Otros",null,"% de Utilidad Propietario","Horas Extra Generadas","Horas Extra Conductor","% de Intermediación","Costo Personal Directo","Soat","RTM","Seguros","Monitoreo","Imp. Rodamiento","Lavadas Generales","Lavadas Furgón","Mtto Termo","Alimentación Directos","Hospedaje Directos","Peajes y Otros","Costo Variable x Km","Horas Extra Directos ($)","Utilidad Propietario","Rete Fuente","Flete sugerido Propietario","Costo Personal x Prestación","Horas Extra Prestación ($)","Alimentación Personal Prest","Hospedaje Personal Prest","Total Costo Aux","Costo Ruta","Intermediación","Tarifa Cliente Sugerida",null,null,"Flete Propietario","Tarifa Cliente"]
["BARRANQUILLA_BOSCONIA","tractomula",{"$f":"VLOOKUP(A3,'peajes NACIONAL '!$B$2:$E$59,4,0)","v":"03:38:00"},"No","Sí",1,1,"Sí",{"$f":"VLOOKUP(A3,'[1]NACIONAL '!B$2:C$58,2,0)","v":207},8871,{"$f":"VLOOKUP(A3,'peajes NACIONAL '!$B$2:$I$59,8,0)","v":136200},1,0.18,1,"Sí",0.185,{"$f":"IFERROR(F3*'Costos Vehículo'!$H$30*L3,\"\")","v":149076.08520961535},{"$f":"IF(OR(B3='Costos Vehículo'!$C$7,B3='Costos Vehículo'!$C$8,B3='Costos Vehículo'!$C$9,B3='Costos Vehículo'!$C$10,B3='Costos Vehículo'!$C$11),'Costos Vehículo'!$D$4/26,IF(B3='Costos Vehículo'!$C$14,'Costos Vehículo'!$D$5/26,0))","v":0},{"$f":"IFERROR(VLOOKUP(B3,'Costos Vehículo'!$C$7:$D$14,2,0)/26,0)","v":1104.2660256410256},{"$f":"IFERROR(VLOOKUP(B3,'Costos Vehículo'!$C$16:$D$23,2,0)/26,0)","v":33799.807692307695},{"$f":"IF(B3<>\"\",'Costos Vehículo'!$D$25/26,0)","v":2051.2820512820513},{"$f":"IFERROR(VLOOKUP(B3,'Costos Vehículo'!$C$26:$D$33,2,0)/26,0)","v":3913.404},{"$f":"IF(B3<>\"\",'Costos Vehículo'!$D$35/26,0)","v":3846.1538461538462},{"$f":"IF(E3=\"Sí\",'Costos Vehículo'!$I$16,0)","v":50000},{"$f":"IF(D3=\"Sí\",'Costos Vehículo'!$K$11/26,0)","v":0},{"$f":"IF(AND(H3=\"Sí\",L3>1),'Costos Vehículo'!$I$13*SUM(F3)+'Costos Vehículo'!$I$15*(L3-1)*SUM(F3),IF(H3=\"Sí\",'Costos Vehículo'!$I$13*SUM(F3),0))","v":60000},{"$f":"IF(L3>1,'Costos Vehículo'!$I$14*SUM(F3)*(L3-1),0)","v":0},{"$f":"IFERROR(K3,0)","v":136200},{"$f":"IFERROR(IF(D3=\"Sí\",(VLOOKUP(B3,'Costos Vehículo'!$G$19:$I$26,3,0)+J3/VLOOKUP(B3,'Costos Vehículo'!$G$19:$L$26,5,0))*I3,(VLOOKUP(B3,'Costos Vehículo'!$G$19:$I$26,3,0)+J3/VLOOKUP(B3,'Costos Vehículo'!$G$19:$J$26,4,0))*I3),0)","v":466912.48214507755},{"$f":"IFERROR(IF(O3=\"Sí\",N3*SUM(F3)*'Costos Vehículo'!$K$29,0),0)","v":19810.420136718749},{"$f":"IFERROR(SUM(Q3:AD3)/(1-M3)-SUM(Q3:AD3),0)","v":203425.00268197956},{"$f":"SUM(Q3:AE3)*'Costos Vehículo'!$H$29","v":58925.442443546774},{"$f":"SUM(Q3:AF3)","v":1189064.3462323227},{"$f":"IFERROR(G3*'Costos Vehículo'!$H$31*L3,0)","v":86300},{"$f":"IFERROR(N3*SUM(G3)*'Costos Vehículo'!$K$28,0)","v":13484.375},{"$f":"IF(AND(H3=\"Sí\",L3>1),'Costos Vehículo'!$I$13*SUM(G3)+'Costos Vehículo'!$I$15*(L3-1)*SUM(G3),IF(H3=\"Sí\",'Costos Vehículo'!$I$13*SUM(G3),0))","v":60000},{"$f":"IF(L3>1,'Costos Vehículo'!$I$14*SUM(G3)*(L3-1),0)","v":0},{"$f":"SUM(AH3:AK3)","v":159784.375},{"$f":"SUM(AG3:AK3)","v":1348848.7212323227},{"$f":"AO3-AM3","v":306180.38457420841},{"$f":"IFERROR(AM3/(1-P3),\"\")","v":1655029.1058065312},null,null,122000,153000,null,null,{"$f":"SUM(AH3:AK3)","v":159784.375}]
["BARRANQUILLA_SANTA MARTA","dobletroque",{"$f":"VLOOKUP(A4,'peajes NACIONAL '!$B$2:$E$59,4,0)","v":"01:56:00"},"No","Sí",1,1,"Sí",{"$f":"VLOOKUP(A4,'[1]NACIONAL '!B$2:C$58,2,0)","v":105},8871,{"$f":"VLOOKUP(A4,'peajes NACIONAL '!$B$2:$I$59,8,0)","v":42800},1,0.18,1,"Sí",0.185,{"$f":"IFERROR(F4*'Costos Vehículo'!$H$30*L4,\"\")","v":149076.08520961535},{"$f":"IF(OR(B4='Costos Vehículo'!$C$7,B4='Costos Vehículo'!$C$8,B4='Costos Vehículo'!$C$9,B4='Costos Vehículo'!$C$10,B4='Costos Vehículo'!$C$11),'Costos Vehículo'!$D$4/26,IF(B4='Costos Vehículo'!$C$14,'Costos Vehículo'!$D$5/26,0))","v":0},{"$f":"IFERROR(VLOOKUP(B4,'Costos Vehículo'!$C$7:$D$14,2,0)/26,0)","v":1104.2660256410256},{"$f":"IFERROR(VLOOKUP(B4,'Costos Vehículo'!$C$16:$D$23,2,0)/26,0)","v":33799.807692307695},{"$f":"IF(B4<>\"\",'Costos Vehículo'!$D$25/26,0)","v":2051.2820512820513},{"$f":"IFERROR(VLOOKUP(B4,'Costos Vehículo'!$C$26:$D$33,2,0)/26,0)","v":3913.404},{"$f":"IF(B4<>\"\",'Costos Vehículo'!$D$35/26,0)","v":3846.1538461538462},{"$f":"IF(E4=\"Sí\",'Costos Vehículo'!$I$16,0)","v":50000},{"$f":"IF(D4=\"Sí\",'Costos Vehículo'!$K$11/26,0)","v":0},{"$f":"IF(AND(H4=\"Sí\",L4>1),'Costos Vehículo'!$I$13*SUM(F4)+'Costos Vehículo'!$I$15*(L4-1)*SUM(F4),IF(H4=\"Sí\",'Costos Vehículo'!$I$13*SUM(F4),0))","v":60000},{"$f":"IF(L4>1,'Costos Vehículo'!$I$14*SUM(F4)*(L4-1),0)","v":0},{"$f":"IFERROR(K4,0)","v":42800},{"$f":"IFERROR(IF(D4=\"Sí\",(VLOOKUP(B4,'Costos Vehículo'!$G$19:$I$26,3,0)+J4/VLOOKUP(B4,'Costos Vehículo'!$G$19:$L$26,5,0))*I4,(VLOOKUP(B4,'Costos Vehículo'!$G$19:$I$26,3,0)+J4/VLOOKUP(B4,'Costos Vehículo'!$G$19:$J$26,4,0))*I4),0)","v":135193.64369444107},{"$f":"IFERROR(IF(O4=\"Sí\",N4*SUM(F4)*'Costos Vehículo'!$K$29,0),0)","v":19810.420136718749},{"$f":"IFERROR(SUM(Q4:AD4)/(1-M4)-SUM(Q4:AD4),0)","v":110106.23326598632},{"$f":"SUM(Q4:AE4)*'Costos Vehículo'!$H$29","v":31894.105569380699},{"$f":"SUM(Q4:AF4)","v":643595.40149152686},{"$f":"IFERROR(G4*'Costos Vehículo'!$H$31*L4,0)","v":86300},{"$f":"IFERROR(N4*SUM(G4)*'Costos Vehículo'!$K$28,0)","v":13484.375},{"$f":"IF(AND(H4=\"Sí\",L4>1),'Costos Vehículo'!$I$13*SUM(G4)+'Costos Vehículo'!$I$15*(L4-1)*SUM(G4),IF(H4=\"Sí\",'Costos Vehículo'!$I$13*SUM(G4),0))","v":60000},{"$f":"IF(L4>1,'Costos Vehículo'!$I$14*SUM(G4)*(L4-1),0)","v":0},{"$f":"SUM(AH4:AK4)","v":159784.375},{"$f":"SUM(AG4:AK4)","v":803379.77649152686},{"$f":"AO4-AM4","v":182362.28055329144},{"$f":"IFERROR(AM4/(1-P4),\"\")","v":985742.0570448183},null,null,165000,207000,null,null,159784.375]
["BARRANQUILLA_VALLEDUPAR","NHR",{"$f":"VLOOKUP(A5,'peajes NACIONAL '!$B$2:$E$59,4,0)","v":"05:35:00"},"No","Sí",1,1,"Sí",{"$f":"VLOOKUP(A5,'[1]NACIONAL '!B$2:C$58,2,0)","v":295},8871,{"$f":"VLOOKUP(A5,'peajes NACIONAL '!$B$2:$I$59,8,0)","v":127600},1,0.18,1,"Sí",0.185,{"$f":"IFERROR(F5*'Costos Vehículo'!$H$30*L5,\"\")","v":149076.08520961535},{"$f":"IF(OR(B5='Costos Vehículo'!$C$7,B5='Costos Vehículo'!$C$8,B5='Costos Vehículo'!$C$9,B5='Costos Vehículo'!$C$10,B5='Costos Vehículo'!$C$11),'Costos Vehículo'!$D$4/26,IF(B5='Costos Vehículo'!$C$14,'Costos Vehículo'!$D$5/26,0))","v":2347.4358974358975},{"$f":"IFERROR(VLOOKUP(B5,'Costos Vehículo'!$C$7:$D$14,2,0)/26,0)","v":811.61217948717956},{"$f":"IFERROR(VLOOKUP(B5,'Costos Vehículo'!$C$16:$D$23,2,0)/26,0)","v":7155.6974715200004},{"$f":"IF(B5<>\"\",'Costos Vehículo'!$D$25/26,0)","v":2051.2820512820513},{"$f":"IFERROR(VLOOKUP(B5,'Costos Vehículo'!$C$26:$D$33,2,0)/26,0)","v":1969.15374},{"$f":"IF(B5<>\"\",'Costos Vehículo'!$D$35/26,0)","v":3846.1538461538462},{"$f":"IF(E5=\"Sí\",'Costos Vehículo'!$I$16,0)","v":50000},{"$f":"IF(D5=\"Sí\",'Costos Vehículo'!$K$11/26,0)","v":0},{"$f":"IF(AND(H5=\"Sí\",L5>1),'Costos Vehículo'!$I$13*SUM(F5)+'Costos Vehículo'!$I$15*(L5-1)*SUM(F5),IF(H5=\"Sí\",'Costos Vehículo'!$I$13*SUM(F5),0))","v":60000},{"$f":"IF(L5>1,'Costos Vehículo'!$I$14*SUM(F5)*(L5-1),0)","v":0},127600,{"$f":"IFERROR(IF(D5=\"Sí\",(VLOOKUP(B5,'Costos Vehículo'!$G$19:$I$26,3,0)+J5/VLOOKUP(B5,'Costos Vehículo'!$G$19:$L$26,5,0))*I5,(VLOOKUP(B5,'Costos Vehículo'!$G$19:$I$26,3,0)+J5/VLOOKUP(B5,'Costos Vehículo'!$G$19:$J$26,4,0))*I5),0)","v":179319.02374928407},{"$f":"IFERROR(IF(O5=\"Sí\",N5*SUM(F5)*'Costos Vehículo'!$K$29,0),0)","v":19810.420136718749},132582.48240325542,{"$f":"SUM(Q5:AE5)*'Costos Vehículo'!$H$29","v":38404.725736143002},774974.07242089557,{"$f":"IFERROR(G5*'Costos Vehículo'!$H$31*L5,0)","v":86300},{"$f":"IFERROR(N5*SUM(G5)*'Costos Vehículo'!$K$28,0)","v":13484.375},{"$f":"IF(AND(H5=\"Sí\",L5>1),'Costos Vehículo'!$I$13*SUM(G5)+'Costos Vehículo'!$I$15*(L5-1)*SUM(G5),IF(H5=\"Sí\",'Costos Vehículo'!$I$13*SUM(G5),0))","v":60000},{"$f":"IF(L5>1,'Costos Vehículo'!$I$14*SUM(G5)*(L5-1),0)","v":0},159784.375,934758.44742089557,212184.43285014201,1146942.8802710376,null,null,141000,177000,null,null,159784.375]
["BOGOTA_AQUITANIA","dobletroque",{"$f":"VLOOKUP(A6,'peajes NACIONAL '!$B$2:$E$59,4,0)","v":"04:15:00"},"No","Sí",1,1,"Sí",{"$f":"VLOOKUP(A6,'[1]NACIONAL '!B$2:C$58,2,0)","v":244},8871,{"$f":"VLOOKUP(A6,'peajes NACIONAL '!$B$2:$I$59,8,0)","v":132600},1,0.18,1,"Sí",0.185,{"$f":"IFERROR(F6*'Costos Vehículo'!$H$30*L6,\"\")","v":149076.08520961535},{"$f":"IF(OR(B6='Costos Vehículo'!$C$7,B6='Costos Vehículo'!$C$8,B6='Costos Vehículo'!$C$9,B6='Costos Vehículo'!$C$10,B6='Costos Vehículo'!$C$11),'Costos Vehículo'!$D$4/26,IF(B6='Costos Vehículo'!$C$14,'Costos Vehículo'!$D$5/26,0))","v":0},{"$f":"IFERROR(VLOOKUP(B6,'Costos Vehículo'!$C$7:$D$14,2,0)/26,0)","v":1104.2660256410256},{"$f":"IFERROR(VLOOKUP(B6,'Costos Vehículo'!$C$16:$D$23,2,0)/26,0)","v":33799.807692307695},{"$f":"IF(B6<>\"\",'Costos Vehículo'!$D$25/26,0)","v":2051.2820512820513},{"$f":"IFERROR(VLOOKUP(B6,'Costos Vehículo'!$C$26:$D$33,2,0)/26,0)","v":3913.404},{"$f":"IF(B6<>\"\",'Costos Vehículo'!$D$35/26,0)","v":3846.1538461538462},{"$f":"IF(E6=\"Sí\",'Costos Vehículo'!$I$16,0)","v":50000},{"$f":"IF(D6=\"Sí\",'Costos Vehículo'!$K$11/26,0)","v":0},{"$f":"IF(AND(H6=\"Sí\",L6>1),'Costos Vehículo'!$I$13*SUM(F6)+'Costos Vehículo'!$I$15*(L6-1)*SUM(F6),IF(H6=\"Sí\",'Costos Vehículo'!$I$13*SUM(F6),0))","v":60000},{"$f":"IF(L6>1,'Costos Vehículo'!$I$14*SUM(F6)*(L6-1),0)","v":0},132600,{"$f":"IFERROR(IF(D6=\"Sí\",(VLOOKUP(B6,'Costos Vehículo'!$G$19:$I$26,3,0)+J6/VLOOKUP(B6,'Costos Vehículo'!$G$19:$L$26,5,0))*I6,(VLOOKUP(B6,'Costos Vehículo'!$G$19:$I$26,3,0)+J6/VLOOKUP(B6,'Costos Vehículo'!$G$19:$J$26,4,0))*I6),0)","v":314164.27677565353},{"$f":"IFERROR(IF(O6=\"Sí\",N6*SUM(F6)*'Costos Vehículo'!$K$29,0),0)","v":19810.420136718749},169104.66491795972,{"$f":"SUM(Q6:AE6)*'Costos Vehículo'!$H$29","v":48983.984604569014},988454.34525990114,{"$f":"IFERROR(G6*'Costos Vehículo'!$H$31*L6,0)","v":86300},{"$f":"IFERROR(N6*SUM(G6)*'Costos Vehículo'!$K$28,0)","v":13484.375},{"$f":"IF(AND(H6=\"Sí\",L6>1),'Costos Vehículo'!$I$13*SUM(G6)+'Costos Vehículo'!$I$15*(L6-1)*SUM(G6),IF(H6=\"Sí\",'Costos Vehículo'!$I$13*SUM(G6),0))","v":60000},{"$f":"IF(L6>1,'Costos Vehículo'!$I$14*SUM(G6)*(L6-1),0)","v":0},159784.375,1148238.7202599011,260643.14508967102,1408881.8653495722,null,null,194000,243000,null,null,159784.375]
{"$rows_left_out":54}
{"sheet":"peajes NACIONAL ","index":4,"n_rows":60,"n_cols":12,"rows_kept":60,"cut":false,"hidden":true,"merged":[]}
[null,"RUTA","DISTANCIA","NUMERO DE PEAJES ","TIEMPO APROX","Categoría I:","Categoría II:","Categoría III:","Categoría IV:","Categoría V:","Categoría VI:","Categoría VII:"]
[null,"BARRANQUILLA_BOSCONIA",207,5,"03:38:00",48000,51000,89200,136200,162000,41000,46300]
[null,"BARRANQUILLA_SANTA MARTA",105,2,"01:56:00",22200,26400,34400,42800,61800,82000,92600]
[null,"BARRANQUILLA_VALLEDUPAR",295,5,"05:35:00",47900,54700,99400,127600,159700,82000,92600]
[null,"BOGOTA_AQUITANIA",244,6,"04:15:00",43000,51000,98500,132600,195100,85400,94600]
[null,"BOGOTA_ARMENIA",282,5,"05:37:00",55400,62300,119600,174300,211600,42200,46600]
{"$rows_left_out":55}
{"sheet":"P&G Operación","index":5,"n_rows":31,"n_cols":30,"rows_kept":31,"cut":false,"hidden":true,"merged":[]}
[]
[]
[]
[]
[null,"Viajes Urbanos Dislicores","Lunes","Martes","Miércoles","Jueves","Viernes","Sábado","Total Semana","Total Mes",null,"Tipo de Vehículo","Flete Propietario","Tarifa Sugerida",null,"Viajes Urbanos Dislicores","Lunes","Martes","Miércoles","Jueves","Viernes","Sábado","Total Semana","Total Mes",null,"Variaciòn %","Variaciòn %",null,"Variaciòn ($)","Variaciòn ($)"]
[null,"BARRANQUILLA_medellin",1,1,1,1,1,1,{"$f":"SUM(C6:H6)","v":6},{"$f":"I6*4.3333","v":25.9998},null,{"$f":"B6","v":"BARRANQUILLA_medellin"},{"$f":"IF(I6=0,\"\",Rutas!AG3)","v":1189064.3462323227},{"$f":"IF(I6=0,\"\",Rutas!AO3)","v":1655029.1058065312},null,"Carry",1,1,1,1,1,1,{"$f":"SUM(Q6:V6)","v":6},{"$f":"W6*4.3333","v":25.9998},null,{"$f":"IFERROR(M6/M21-1,\"\")","v":""},"",null,{"$f":"IFERROR(M6-M6/(1+Z6),\"\")","v":""},{"$f":"IFERROR(N6-N6/(1+AA6),\"\")","v":""}]
{"$rows_left_out":26}
{"sheet":"Escenario Actual","index":6,"n_rows":30,"n_cols":30,"rows_kept":30,"cut":false,"hidden":true,"merged":[]}
[]
[null,"Operación Dislicores",null,"Operación Actual: Auxiliares por prestación, horas extra pagadas fuera del flete para los auxiliares.",null,null,null,null,null,null,null,null,null,null,null,"Operación Dislicores",null,"Con fletes actuales y auxiliares por prestación de servicios"]
[]
[null,"Viajes Urbanos Dislicores","Lunes","Martes","Miércoles","Jueves","Viernes","Sábado","Total Semana","Total Mes",null,"Tipo de Vehículo","Flete Propietario","Tarifa Sugerida",null,"Viajes Urbanos Dislicores","Lunes","Martes","Miércoles","Jueves","Viernes","Sábado","Total Semana","Total Mes",null,"Variaciòn %","Variaciòn %",null,"Variaciòn ($)","Variaciòn ($)"]
[null,"Carry Aux Prest",2,2,2,2,2,2,12,51.999600000000001,null,"Carry Aux Prest",130000,257499.99999999264,null,"Carry",1,1,1,1,1,1,6,25.9998,null,0,-2.8643754035329039E-14,null,0,-7.363269105553627E-9]
[null,"Luv Aux Prest",1,2,2,2,2,1,10,43.333000000000006,null,"Luv Aux Prest",150000,282499.99999998341,null,"Luv",1,2,2,2,2,1,10,43.333000000000006,null,0,-5.8730798002670781E-14,null,0,-1.6589183360338211E-8]
{"$rows_left_out":24}